BDBM50428036 CHEMBL2324265
SMILES Fc1ccc(cc1)-n1nc(C(=O)NCC(=O)Nc2nc3ccc(cc3s2)C(F)(F)F)c2ccccc2c1=O
InChI Key InChIKey=LOCPWBZGUDQMCV-UHFFFAOYSA-N
Data  1 EC50
  Tab Delimited (TSV)   2D SDfile   Computed 3D by Vconf -m prep SDfile
Find this compound or compounds like it in BindingDB:
Activity Spreadsheet -- Enzyme Inhibition Constant Data from BindingDB
Found 1 hit for monomerid = 50428036
TargetProtein-serine O-palmitoleoyltransferase porcupine(Mus musculus)
The University Of Texas Southwestern Medical Center
Curated by ChEMBL
LigandPNGBDBM50428036(CHEMBL2324265)
Affinity DataEC50:  90nM. Assay description: Inhibition of porcupine-mediated Wnt signalling in mouse L cells after 24 hrs by SpringerImages-Topflash reporter assay
In DepthDetails ArticlePubMed